Target
Low molecular weight phosphotyrosine protein phosphatase
Ligand
BDBM95018
Substrate
IC50
7260±n/a nM
Citation
 PubChem, PC Dose response confirmation of small molecule inhibitors of Low Molecular Weight Protein Tyrosine Phosphatase, LMPTP, via a fluorescence intensity assay PubChem Bioassay (2012)[AID] 
Target
Name:
Low molecular weight phosphotyrosine protein phosphatase
Synonyms:
3.1.3.2 ACP1 LMW-PTP LMWPTP PPAC_HUMAN low molecular weight phosphotyrosine protein phosphatase isoform c
Type:
Mol. Mass.:
18042.81
Organism:
Homo sapiens (Human)
Description:
P24666
Residue:
158
  
Inhibitor
Name:
BDBM95018
Synonyms:
1-ethyl-6-fluoranyl-7-[4-[(4-methoxyphenyl)carbonylcarbamothioyl]piperazin-1-yl]-4-oxidanylidene-quinoline-3-carboxylic acid 1-ethyl-6-fluoro-7-[4-[(4-methoxybenzoyl)carbamothioyl]piperazin-1-yl]-4-oxoquinoline-3-carboxylic acid MLS001075341 cid_4351062
Type:
Small organic molecule
Emp. Form.:
C25H25FN4O5S
Mol. Mass.:
512.553
SMILES:
CCn1cc(C(O)=O)c(=O)c2cc(F)c(cc12)N1CCN(CC1)C(=S)NC(=O)c1ccc(OC)cc1
: