Target
Hepatocyte nuclear factor 4-alpha
Ligand
BDBM87845
Substrate
IC50
813.65±n/a nM
Citation
 PubChem, PC Counterscreen for inhibitors of the interaction of the lipase co-activator protein, abhydrolase domain containing 5 (ABHD5) with perilipin-5 (MLDP; PLIN5): Luminescence-based biochemical high throughput dose response assay to identify inhibitors of Hepatocyte nuclear factor 4 (HNF4) dimerization PubChem Bioassay (2012)[AID] 
Target
Name:
Hepatocyte nuclear factor 4-alpha
Synonyms:
HNF4 HNF4A_HUMAN TCF14 | hepatocyte nuclear factor 4-alpha isoform b
Type:
PROTEIN
Mol. Mass.:
52790.24
Organism:
Homo sapiens (Human)
Description:
ChEMBL_606516
Residue:
474
  
Inhibitor
Name:
BDBM87845
Synonyms:
2-Butyl-thiazolidine-4-carboxylic acid 2-butyl-4-thiazolidinecarboxylic acid MLS000548320 cid_3132640
Type:
Small organic molecule
Emp. Form.:
C8H15NO2S
Mol. Mass.:
189.275
SMILES:
CCCCC1NC(CS1)C(O)=O
: