Target
Hepatocyte nuclear factor 4-alpha
Ligand
BDBM94549
Substrate
IC50
1811±n/a nM
Citation
 PubChem, PC Counterscreen for inhibitors of the interaction of the lipase co-activator protein, abhydrolase domain containing 5 (ABHD5) with perilipin-5 (MLDP; PLIN5): Luminescence-based biochemical high throughput dose response assay to identify inhibitors of Hepatocyte nuclear factor 4 (HNF4) dimerization PubChem Bioassay (2012)[AID] 
Target
Name:
Hepatocyte nuclear factor 4-alpha
Synonyms:
HNF4 HNF4A_HUMAN TCF14 | hepatocyte nuclear factor 4-alpha isoform b
Type:
PROTEIN
Mol. Mass.:
52790.24
Organism:
Homo sapiens (Human)
Description:
ChEMBL_606516
Residue:
474
  
Inhibitor
Name:
BDBM94549
Synonyms:
MLS003674221 N-tert-butyl-2-[3-(2-furyl)-2-keto-quinoxalin-1-yl]-2-[4-(trifluoromethyl)phenyl]acetamide N-tert-butyl-2-[3-(furan-2-yl)-2-oxoquinoxalin-1-yl]-2-[4-(trifluoromethyl)phenyl]acetamide cid_53383346
Type:
Small organic molecule
Emp. Form.:
C25H22F3N3O3
Mol. Mass.:
469.4557
SMILES:
CC(C)(C)NC(=O)C(c1ccc(cc1)C(F)(F)F)n1c2ccccc2nc(-c2ccco2)c1=O
: