Target
Envelope glycoprotein gp160
Ligand
BDBM66270
Substrate
IC50
>67047±n/a nM
Citation
 PubChem, PC TRFRET-based biochemical high throughput dose response assay for small molecules that bind to the HIV-1-gp120 binding antibody, PG9 PubChem Bioassay (2012)[AID] 
Target
Name:
Envelope glycoprotein gp160
Synonyms:
ENV_HV1H2 Envelope surface glycoprotein gp160, precursor env
Type:
Mol. Mass.:
97241.93
Organism:
Human immunodeficiency virus type 1 group M subtype B (isolate HXB2)
Description:
Residue:
856
  
Inhibitor
Name:
BDBM66270
Synonyms:
3-(cyclopropanecarbonylamino)-N-(4-methoxyphenyl)-1-benzofuran-2-carboxamide 3-(cyclopropylcarbonylamino)-N-(4-methoxyphenyl)-1-benzofuran-2-carboxamide 3-[[cyclopropyl(oxo)methyl]amino]-N-(4-methoxyphenyl)-2-benzofurancarboxamide SMR000028624 | cid_3243757
Type:
Small organic molecule
Emp. Form.:
C20H18N2O4
Mol. Mass.:
350.3679
SMILES:
COc1ccc(NC(=O)c2oc3ccccc3c2NC(=O)C2CC2)cc1
: