Target
Envelope glycoprotein gp160
Ligand
BDBM33060
Substrate
IC50
>67045±n/a nM
Citation
 PubChem, PC Counterscreen for discovery of small molecules that bind to the HIV-1-gp120 binding antibody, PG9 PubChem Bioassay (2012)[AID] 
Target
Name:
Envelope glycoprotein gp160
Synonyms:
ENV_HV1H2 Envelope surface glycoprotein gp160, precursor env
Type:
Mol. Mass.:
97241.93
Organism:
Human immunodeficiency virus type 1 group M subtype B (isolate HXB2)
Description:
Residue:
856
  
Inhibitor
Name:
BDBM33060
Synonyms:
4-(5-methyl-2-furanyl)-2-sulfanylidene-5,6,7,8-tetrahydro-1H-quinoline-3-carbonitrile 4-(5-methylfuran-2-yl)-2-sulfanylidene-5,6,7,8-tetrahydro-1H-quinoline-3-carbonitrile SMR000102919 | cid_783279
Type:
Small organic molecule
Emp. Form.:
C15H14N2OS
Mol. Mass.:
270.349
SMILES:
Cc1ccc(o1)-c1c2CCCCc2[nH]c(=S)c1C#N
: