Target
Envelope glycoprotein gp160
Ligand
BDBM95302
Substrate
IC50
>67035±n/a nM
Citation
 PubChem, PC Counterscreen for discovery of small molecules that bind to the HIV-1-gp120 binding antibody, PG9 PubChem Bioassay (2012)[AID] 
Target
Name:
Envelope glycoprotein gp160
Synonyms:
ENV_HV1H2 Envelope surface glycoprotein gp160, precursor env
Type:
Mol. Mass.:
97241.93
Organism:
Human immunodeficiency virus type 1 group M subtype B (isolate HXB2)
Description:
Residue:
856
  
Inhibitor
Name:
BDBM95302
Synonyms:
(2-morpholin-4-yl-5-nitro-phenyl)-[4-(4-nitrophenyl)piperazin-1-yl]methanone (2-morpholino-5-nitro-phenyl)-[4-(4-nitrophenyl)piperazino]methanone SMR000716594 cid_16294829
Type:
Small organic molecule
Emp. Form.:
C21H23N5O6
Mol. Mass.:
441.4372
SMILES:
[O-][N+](=O)c1ccc(cc1)N1CCN(CC1)C(=O)c1cc(ccc1N1CCOCC1)[N+]([O-])=O
: