Target
Envelope glycoprotein gp160
Ligand
BDBM95309
Substrate
IC50
2138±n/a nM
Citation
 PubChem, PC Counterscreen for discovery of small molecules that bind to the HIV-1-gp120 binding antibody, PG9 PubChem Bioassay (2012)[AID] 
Target
Name:
Envelope glycoprotein gp160
Synonyms:
ENV_HV1H2 Envelope surface glycoprotein gp160, precursor env
Type:
Mol. Mass.:
97241.93
Organism:
Human immunodeficiency virus type 1 group M subtype B (isolate HXB2)
Description:
Residue:
856
  
Inhibitor
Name:
BDBM95309
Synonyms:
5-(1,3-benzodioxol-5-yl)-2-(4-methoxyphenyl)-1-methyl-3-(phenylthio)indole 5-(1,3-benzodioxol-5-yl)-2-(4-methoxyphenyl)-1-methyl-3-phenylsulfanylindole SMR002252916 | cid_53301435
Type:
Small organic molecule
Emp. Form.:
C29H23NO3S
Mol. Mass.:
465.563
SMILES:
COc1ccc(cc1)-c1c(Sc2ccccc2)c2cc(ccc2n1C)-c1ccc2OCOc2c1
: