Target
Envelope glycoprotein gp160
Ligand
BDBM95259
Substrate
IC50
24318±n/a nM
Citation
 PubChem, PC Counterscreen for discovery of small molecules that bind to the HIV-1-gp120 binding antibody, PG9 PubChem Bioassay (2012)[AID] 
Target
Name:
Envelope glycoprotein gp160
Synonyms:
ENV_HV1H2 Envelope surface glycoprotein gp160, precursor env
Type:
Mol. Mass.:
97241.93
Organism:
Human immunodeficiency virus type 1 group M subtype B (isolate HXB2)
Description:
Residue:
856
  
Inhibitor
Name:
BDBM95259
Synonyms:
3,4-dimethyl-2-(4-methylphenyl)-2,6-dihydro-7H-pyrazolo[3,4-d]pyridazine-7-thione 3,4-dimethyl-2-(p-tolyl)-6H-pyrazolo[3,4-d]pyridazine-7-thione SMR000161327 | cid_1234246
Type:
Small organic molecule
Emp. Form.:
C14H14N4S
Mol. Mass.:
270.353
SMILES:
Cc1n(nc2c1c(C)n[nH]c2=S)-c1ccc(C)cc1
: