Target
Envelope glycoprotein gp160
Ligand
BDBM37158
Substrate
IC50
>22334±n/a nM
Citation
 PubChem, PC Counterscreen for discovery of small molecules that bind to the HIV-1-gp120 binding antibody, PG9 PubChem Bioassay (2012)[AID] 
Target
Name:
Envelope glycoprotein gp160
Synonyms:
ENV_HV1H2 Envelope surface glycoprotein gp160, precursor env
Type:
Mol. Mass.:
97241.93
Organism:
Human immunodeficiency virus type 1 group M subtype B (isolate HXB2)
Description:
Residue:
856
  
Inhibitor
Name:
BDBM37158
Synonyms:
MLS000119034 N-(5-ethylsulfanyl-1,3,4-thiadiazol-2-yl)-3-phenyl-2-pyrrol-1-ylpropanamide N-[5-(ethylthio)-1,3,4-thiadiazol-2-yl]-3-phenyl-2-pyrrol-1-yl-propionamide cid_5307791
Type:
Small organic molecule
Emp. Form.:
C17H18N4OS2
Mol. Mass.:
358.481
SMILES:
CCSc1nnc(NC(=O)C(Cc2ccccc2)n2cccc2)s1
: