Target
Mitochondrial peptide methionine sulfoxide reductase
Ligand
BDBM48030
Substrate
IC50
14183±n/a nM
Citation
 PubChem, PC Absorbance-based biochemical high throughput dose response assay to identify inhibitors of Methionine sulfoxide reductase A (MsrA) PubChem Bioassay (2013)[AID] 
Target
Name:
Mitochondrial peptide methionine sulfoxide reductase
Synonyms:
MSRA MSRA_BOVIN
Type:
Enzyme Catalytic Domain
Mol. Mass.:
25822.90
Organism:
Bos taurus
Description:
gi_73586699
Residue:
233
  
Inhibitor
Name:
BDBM48030
Synonyms:
4-[(E)-[3-(2-fluoroanilino)-4-keto-1-naphthylidene]amino]sulfonylbenzoic acid 4-[(E)-[3-(2-fluoroanilino)-4-oxonaphthalen-1-ylidene]amino]sulfonylbenzoic acid MLS000948172 cid_6023694
Type:
Small organic molecule
Emp. Form.:
C23H15FN2O5S
Mol. Mass.:
450.439
SMILES:
OC(=O)c1ccc(cc1)S(=O)(=O)N=C1C=C(Nc2ccccc2F)C(=O)c2ccccc12
: