Target
Nuclear receptor subfamily 5 group A member 2
Ligand
BDBM95476
Substrate
IC50
1133±n/a nM
Citation
 PubChem, PC Luminescence-based cell-based high throughput dose response assay for inverse agonists of the liver receptor homolog-1 (LRH-1; NR5A2) PubChem Bioassay (2013)[AID] 
Target
Name:
Nuclear receptor subfamily 5 group A member 2
Synonyms:
Alpha-1-fetoprotein transcription factor B1F CYP7A promoter-binding factor Hepatocytic transcription factor Liver Receptor Homolog 1 NR5A2_HUMAN hB1F | nuclear receptor subfamily 5 group A member 2 isoform 2
Type:
Nuclear Hormone Receptor
Mol. Mass.:
61341.37
Organism:
Homo sapiens (Human)
Description:
Residue:
541
  
Inhibitor
Name:
BDBM95476
Synonyms:
MLS000050294 N-[2-methyl-5-(3-methyl-[1,2,4]triazolo[3,4-b][1,3,4]thiadiazol-6-yl)phenyl]thiophene-2-carboxamide SMR000077490 | cid_1091676
Type:
Small organic molecule
Emp. Form.:
C16H13N5OS2
Mol. Mass.:
355.437
SMILES:
Cc1nnc2sc(nn12)-c1ccc(C)c(NC(=O)c2cccs2)c1
: