Target
Nuclear receptor subfamily 5 group A member 2
Ligand
BDBM55066
Substrate
IC50
1153±n/a nM
Citation
 PubChem, PC Luminescence-based cell-based high throughput dose response assay for inverse agonists of the liver receptor homolog-1 (LRH-1; NR5A2) PubChem Bioassay (2013)[AID] 
Target
Name:
Nuclear receptor subfamily 5 group A member 2
Synonyms:
Alpha-1-fetoprotein transcription factor B1F CYP7A promoter-binding factor Hepatocytic transcription factor Liver Receptor Homolog 1 NR5A2_HUMAN hB1F | nuclear receptor subfamily 5 group A member 2 isoform 2
Type:
Nuclear Hormone Receptor
Mol. Mass.:
61341.37
Organism:
Homo sapiens (Human)
Description:
Residue:
541
  
Inhibitor
Name:
BDBM55066
Synonyms:
MLS001139963 N-[4,5-bis(2-furyl)thiazol-2-yl]-5-nitro-2-furamide N-[4,5-bis(furan-2-yl)-1,3-thiazol-2-yl]-5-nitrofuran-2-carboxamide cid_24818137
Type:
Small organic molecule
Emp. Form.:
C16H9N3O6S
Mol. Mass.:
371.324
SMILES:
[O-][N+](=O)c1ccc(o1)C(=O)Nc1nc(-c2ccco2)c(s1)-c1ccco1
: