Target
Methionine--tRNA ligase
Ligand
BDBM95696
Substrate
IC50
489.38±n/a nM
Citation
 PubChem, PC Luminescence-based biochemical high throughput dose response assay for inhibitors of Trypanosoma brucei methionyl tRNA synthetase (MetRS) PubChem Bioassay (2013)[AID] 
Target
Name:
Methionine--tRNA ligase
Synonyms:
methionyl-tRNA synthetase
Type:
Enzyme Catalytic Domain
Mol. Mass.:
86905.45
Organism:
Trypanosoma brucei brucei strain 927/4 GUTat10.1
Description:
gi_71746704
Residue:
773
  
Inhibitor
Name:
BDBM95696
Synonyms:
MLS000121584 N-(1,3-benzodioxol-5-yl)-2-[(8-methoxy-5H-[1,2,4]triazino[5,6-b]indol-3-yl)sulfanyl]acetamide N-(1,3-benzodioxol-5-yl)-2-[(8-methoxy-5H-[1,2,4]triazino[5,6-b]indol-3-yl)thio]acetamide SMR000118952 | cid_5770420
Type:
Small organic molecule
Emp. Form.:
C19H15N5O4S
Mol. Mass.:
409.419
SMILES:
COc1ccc2[nH]c3nc(SCC(=O)Nc4ccc5OCOc5c4)nnc3c2c1
: