Target
Tyrosine-protein phosphatase non-receptor type 22
Ligand
BDBM94944
Substrate
IC50
26600±n/a nM
Citation
 PubChem, PC Dose response confirmation of small molecule inhibitors of Low Molecular Weight Protein Tyrosine Phosphatase, LMPTP, in a fluorescence-based, Lymphoid Phosphatase (PTPN22, LYP-1) selectivity Assay PubChem Bioassay (2013)[AID] 
Target
Name:
Tyrosine-protein phosphatase non-receptor type 22
Synonyms:
3.1.3.48 LyP Lymphoid phosphatase (Lyp) PEST-domain phosphatase PTPN22 Tyrosine-protein phosphatase non-receptor type 22 (LYP) | tyrosine-protein phosphatase non-receptor type 22 isoform 1
Type:
Mol. Mass.:
91712.31
Organism:
Homo sapiens (Human)
Description:
Q9Y2R2
Residue:
807
  
Inhibitor
Name:
BDBM94944
Synonyms:
5-[[1-(2-furanylmethyl)-4-triazolyl]methyl]-3-methyl-1,1-dioxo-2-[[4-(3-pyridinyl)phenyl]methyl]-1,2,5-thiadiazepan-4-one 5-[[1-(furan-2-ylmethyl)-1,2,3-triazol-4-yl]methyl]-3-methyl-1,1-bis(oxidanylidene)-2-[(4-pyridin-3-ylphenyl)methyl]-1,2,5-thiadiazepan-4-one MLS003314853 cid_51360521
Type:
Small organic molecule
Emp. Form.:
C25H26N6O4S
Mol. Mass.:
506.577
SMILES:
CC1N(Cc2ccc(cc2)-c2cccnc2)S(=O)(=O)CCN(Cc2cn(Cc3ccco3)nn2)C1=O
: