Target
Fructose-bisphosphate aldolase
Ligand
BDBM96122
Substrate
IC50
1174±n/a nM
Citation
 PubChem, PC Fluorescence-based biochemical high throughput dose response assay for inhibitors of the fructose-bisphosphate aldolase (FBA) of M. tuberculosis PubChem Bioassay (2013)[AID] 
Target
Name:
Fructose-bisphosphate aldolase
Synonyms:
ALF_MYCTU FBPA Fructose-1,6-bisphosphate aldolase (FBA) Probable fructose-bisphosphate aldolase Fba | fba
Type:
Protein
Mol. Mass.:
36539.01
Organism:
Mycobacterium tuberculosis (strain H37Rv)
Description:
P9WQA3
Residue:
344
  
Inhibitor
Name:
BDBM96122
Synonyms:
1-[4-[2-(5-chloranylthiophen-2-yl)quinolin-4-yl]carbonylpiperazin-1-yl]ethanone 1-[4-[2-(5-chlorothiophen-2-yl)quinoline-4-carbonyl]piperazin-1-yl]ethanone MLS001128134 cid_24982832
Type:
Small organic molecule
Emp. Form.:
C20H18ClN3O2S
Mol. Mass.:
399.894
SMILES:
CC(=O)N1CCN(CC1)C(=O)c1cc(nc2ccccc12)-c1ccc(Cl)s1
: