Target
Fructose-bisphosphate aldolase
Ligand
BDBM96200
Substrate
IC50
484.64±n/a nM
Citation
 PubChem, PC Fluorescence-based biochemical high throughput dose response assay for inhibitors of the fructose-bisphosphate aldolase (FBA) of M. tuberculosis PubChem Bioassay (2013)[AID] 
Target
Name:
Fructose-bisphosphate aldolase
Synonyms:
ALF_MYCTU FBPA Fructose-1,6-bisphosphate aldolase (FBA) Probable fructose-bisphosphate aldolase Fba | fba
Type:
Protein
Mol. Mass.:
36539.01
Organism:
Mycobacterium tuberculosis (strain H37Rv)
Description:
P9WQA3
Residue:
344
  
Inhibitor
Name:
BDBM96200
Synonyms:
7-[[2-(3,4-dihydro-1H-isoquinolin-2-yl)-1-oxoethyl]amino]-5H-[1,3]dioxolo[4,5-f]indole-6-carboxylic acid ethyl ester MLS000036721 cid_661761 ethyl 7-[[2-(3,4-dihydro-1H-isoquinolin-2-yl)acetyl]amino]-5H-[1,3]dioxolo[4,5-f]indole-6-carboxylate
Type:
Small organic molecule
Emp. Form.:
C23H23N3O5
Mol. Mass.:
421.4458
SMILES:
CCOC(=O)c1[nH]c2cc3OCOc3cc2c1NC(=O)CN1CCc2ccccc2C1
: