Target
RecBCD enzyme subunit RecD
Ligand
BDBM96244
Substrate
IC50
>39506±n/a nM
Citation
 PubChem, PC Absorbance-based bacterial cell-based high throughput dose response assay to identify inhibitors of RecBCD PubChem Bioassay (2013)[AID] 
Target
Name:
RecBCD enzyme subunit RecD
Synonyms:
RECD_ECOLI hopE | recD
Type:
Enzyme Catalytic Domain
Mol. Mass.:
66906.68
Organism:
Escherichia coli str. K-12 substr. MG1655
Description:
gi_16130723
Residue:
608
  
Inhibitor
Name:
BDBM96244
Synonyms:
5-nitro-N-(6-methylpyridin-2-yl)furan-2-carboxamide N-(6-methyl-2-pyridinyl)-5-nitro-2-furancarboxamide N-(6-methylpyridin-2-yl)-5-nitro-furan-2-carboxamide SMR000163586 | cid_823976
Type:
Small organic molecule
Emp. Form.:
C11H9N3O4
Mol. Mass.:
247.2069
SMILES:
Cc1cccc(NC(=O)c2ccc(o2)[N+]([O-])=O)n1
: