Target
RecBCD enzyme subunit RecD
Ligand
BDBM59956
Substrate
IC50
>118568±n/a nM
Citation
 PubChem, PC Absorbance-based bacterial cell-based high throughput dose response assay to identify inhibitors of RecBCD PubChem Bioassay (2013)[AID] 
Target
Name:
RecBCD enzyme subunit RecD
Synonyms:
RECD_ECOLI hopE | recD
Type:
Enzyme Catalytic Domain
Mol. Mass.:
66906.68
Organism:
Escherichia coli str. K-12 substr. MG1655
Description:
gi_16130723
Residue:
608
  
Inhibitor
Name:
BDBM59956
Synonyms:
4-[[(Z)-[1-(3,4-dimethylphenyl)-3-methyl-5-oxidanylidene-pyrazol-4-ylidene]methyl]amino]-N-(5-ethyl-1,3,4-thiadiazol-2-yl)benzenesulfonamide 4-[[(Z)-[1-(3,4-dimethylphenyl)-3-methyl-5-oxopyrazol-4-ylidene]methyl]amino]-N-(5-ethyl-1,3,4-thiadiazol-2-yl)benzenesulfonamide 4-{[1-(3,4-Dimethyl-phenyl)-3-methyl-5-oxo-1,5-dihydro-pyrazol-4-ylidenemethyl]-amino}-N-(5-ethyl-[1,3,4]thiadiazol-2-yl)-benzenesulfonamide SMR000171530 | cid_5724294
Type:
Small organic molecule
Emp. Form.:
C23H24N6O3S2
Mol. Mass.:
496.605
SMILES:
CCc1nnc(NS(=O)(=O)c2ccc(cc2)N=Cc2c(C)[nH]n(-c3ccc(C)c(C)c3)c2=O)s1
: