Target
RecBCD enzyme subunit RecD
Ligand
BDBM96260
Substrate
IC50
>39493±n/a nM
Citation
 PubChem, PC Absorbance-based bacterial cell-based high throughput dose response assay to identify inhibitors of RecBCD PubChem Bioassay (2013)[AID] 
Target
Name:
RecBCD enzyme subunit RecD
Synonyms:
RECD_ECOLI hopE | recD
Type:
Enzyme Catalytic Domain
Mol. Mass.:
66906.68
Organism:
Escherichia coli str. K-12 substr. MG1655
Description:
gi_16130723
Residue:
608
  
Inhibitor
Name:
BDBM96260
Synonyms:
(E)-1-(4-methyl-1-piperazinyl)-3-(5-nitro-2-furanyl)-2-propen-1-one (E)-1-(4-methylpiperazino)-3-(5-nitro-2-furyl)prop-2-en-1-one SMR000528276 | cid_5356520
Type:
Small organic molecule
Emp. Form.:
C12H15N3O4
Mol. Mass.:
265.2652
SMILES:
CN1CCN(CC1)C(=O)\C=C\c1ccc(o1)[N+]([O-])=O
: