Target
RecBCD enzyme subunit RecD
Ligand
BDBM96277
Substrate
IC50
79834±n/a nM
Citation
 PubChem, PC Absorbance-based bacterial cell-based high throughput dose response assay to identify inhibitors of RecBCD PubChem Bioassay (2013)[AID] 
Target
Name:
RecBCD enzyme subunit RecD
Synonyms:
RECD_ECOLI hopE | recD
Type:
Enzyme Catalytic Domain
Mol. Mass.:
66906.68
Organism:
Escherichia coli str. K-12 substr. MG1655
Description:
gi_16130723
Residue:
608
  
Inhibitor
Name:
BDBM96277
Synonyms:
5-nitro-N-(3-pyridinyl)-2-thiophenecarboxamide 5-nitro-N-pyridin-3-yl-thiophene-2-carboxamide MLS002162657 cid_314146
Type:
Small organic molecule
Emp. Form.:
C10H7N3O3S
Mol. Mass.:
249.246
SMILES:
[O-][N+](=O)c1ccc(s1)C(=O)Nc1cccnc1
: