Target
RecBCD enzyme subunit RecD
Ligand
BDBM96279
Substrate
IC50
63537±n/a nM
Citation
 PubChem, PC Absorbance-based bacterial cell-based high throughput dose response assay to identify inhibitors of RecBCD PubChem Bioassay (2013)[AID] 
Target
Name:
RecBCD enzyme subunit RecD
Synonyms:
RECD_ECOLI hopE | recD
Type:
Enzyme Catalytic Domain
Mol. Mass.:
66906.68
Organism:
Escherichia coli str. K-12 substr. MG1655
Description:
gi_16130723
Residue:
608
  
Inhibitor
Name:
BDBM96279
Synonyms:
2,3,4,5-tetrachlorophenol MLS002415677 cid_21013
Type:
Small organic molecule
Emp. Form.:
C6H2Cl4O
Mol. Mass.:
231.891
SMILES:
Oc1cc(Cl)c(Cl)c(Cl)c1Cl
: