Target
RecBCD enzyme subunit RecD
Ligand
BDBM80057
Substrate
IC50
66923±n/a nM
Citation
 PubChem, PC Absorbance-based bacterial cell-based high throughput dose response assay to identify inhibitors of RecBCD PubChem Bioassay (2013)[AID] 
Target
Name:
RecBCD enzyme subunit RecD
Synonyms:
RECD_ECOLI hopE | recD
Type:
Enzyme Catalytic Domain
Mol. Mass.:
66906.68
Organism:
Escherichia coli str. K-12 substr. MG1655
Description:
gi_16130723
Residue:
608
  
Inhibitor
Name:
BDBM80057
Synonyms:
MLS002607898 N-[4-(5-nitrofuran-2-yl)sulfanylphenyl]ethanamide N-[4-[(5-nitro-2-furyl)thio]phenyl]acetamide cid_234636
Type:
Small organic molecule
Emp. Form.:
C12H10N2O4S
Mol. Mass.:
278.284
SMILES:
CC(=O)Nc1ccc(Sc2ccc(o2)[N+]([O-])=O)cc1
: