Target
Huntingtin
Ligand
BDBM48867
Substrate
IC50
783.97±n/a nM
Citation
 PubChem, PC Fluorescence-based biochemical high throughput dose response assay to identify molecules that bind r(CAG) RNA repeats PubChem Bioassay (2013)[AID] 
Target
Name:
Huntingtin
Synonyms:
HD HD_HUMAN Homo sapiens huntingtin (HTT), mRNA Huntington disease protein | IT15
Type:
PROTEIN
Mol. Mass.:
347579.69
Organism:
Homo sapiens (Human)
Description:
EBI_101216
Residue:
3142
  
Inhibitor
Name:
BDBM48867
Synonyms:
(5Z)-2,6-diketo-4-methyl-5-[[5-(4-methyl-2-nitro-phenyl)-2-furyl]methylene]nicotinonitrile (5Z)-4-methyl-5-[[5-(4-methyl-2-nitro-phenyl)furan-2-yl]methylidene]-2,6-bis(oxidanylidene)pyridine-3-carbonitrile (5Z)-4-methyl-5-[[5-(4-methyl-2-nitrophenyl)furan-2-yl]methylidene]-2,6-dioxopyridine-3-carbonitrile SMR000305708 | cid_5884223
Type:
Small organic molecule
Emp. Form.:
C19H13N3O5
Mol. Mass.:
363.3236
SMILES:
Cc1ccc(-c2ccc([CH+]c3c(C)[c-](C#N)c(=O)[nH]c3=O)o2)c(c1)[N+]([O-])=O
: