Target
Huntingtin
Ligand
BDBM96462
Substrate
IC50
1012±n/a nM
Citation
 PubChem, PC Fluorescence-based biochemical high throughput dose response assay to identify molecules that bind r(CAG) RNA repeats PubChem Bioassay (2013)[AID] 
Target
Name:
Huntingtin
Synonyms:
HD HD_HUMAN Homo sapiens huntingtin (HTT), mRNA Huntington disease protein | IT15
Type:
PROTEIN
Mol. Mass.:
347579.69
Organism:
Homo sapiens (Human)
Description:
EBI_101216
Residue:
3142
  
Inhibitor
Name:
BDBM96462
Synonyms:
2-[(6E)-1-benzyl-2,4,5-triketo-6-p-anisylidene-7H-pyrrolo[2,3-d]pyrimidin-3-yl]acetic acid methyl ester MLS000516399 cid_6512137 methyl 2-[(6E)-6-[(4-methoxyphenyl)methylidene]-2,4,5-tris(oxidanylidene)-1-(phenylmethyl)-7H-pyrrolo[2,3-d]pyrimidin-3-yl]ethanoate
Type:
Small organic molecule
Emp. Form.:
C24H21N3O6
Mol. Mass.:
447.44
SMILES:
COC(=O)Cn1c(=O)c2C(=O)C(Nc2n(Cc2ccccc2)c1=O)=Cc1ccc(OC)cc1
: