Target
Huntingtin
Ligand
BDBM61059
Substrate
IC50
1470±n/a nM
Citation
 PubChem, PC Fluorescence-based biochemical high throughput dose response assay to identify molecules that bind r(CAG) RNA repeats PubChem Bioassay (2013)[AID] 
Target
Name:
Huntingtin
Synonyms:
HD HD_HUMAN Homo sapiens huntingtin (HTT), mRNA Huntington disease protein | IT15
Type:
PROTEIN
Mol. Mass.:
347579.69
Organism:
Homo sapiens (Human)
Description:
EBI_101216
Residue:
3142
  
Inhibitor
Name:
BDBM61059
Synonyms:
2-[5-(2,5-Dichloro-phenyl)-furan-2-yl]-6-mercapto-4-oxo-1-phenyl-1,2,3,4-tetrahydro-pyrimidine-5-carbonitrile 2-[5-(2,5-dichlorophenyl)-2-furyl]-6-keto-4-mercapto-3-phenyl-1,2-dihydropyrimidine-5-carbonitrile 2-[5-[2,5-bis(chloranyl)phenyl]furan-2-yl]-6-oxidanylidene-3-phenyl-4-sulfanyl-1,2-dihydropyrimidine-5-carbonitrile SMR000218337 | cid_3289988
Type:
Small organic molecule
Emp. Form.:
C21H13Cl2N3O2S
Mol. Mass.:
442.318
SMILES:
Clc1ccc(Cl)c(c1)-c1ccc(o1)C1NC(=O)C(C#N)C(=S)N1c1ccccc1
: