Target
Guanine nucleotide-binding protein subunit alpha-15
Ligand
BDBM50325537
Substrate
EC50
>29892±n/a nM
Citation
 PubChem, PC Counterscreen for agonists of the human trace amine associated receptor 1 (TAAR1): Fluorescence-based cell-based high throughput dose response assay to identify nonselective Ga16 agonists PubChem Bioassay (2013)[AID] 
Target
Name:
Guanine nucleotide-binding protein subunit alpha-15
Synonyms:
G-protein subunit alpha-16 GNA15 GNA16 | guanine nucleotide-binding protein subunit alpha-15
Type:
Protein
Mol. Mass.:
43577.62
Organism:
Homo sapiens (Human)
Description:
P30679
Residue:
374
  
Inhibitor
Name:
BDBM50325537
Synonyms:
CHEMBL1224310 S-(2-Chlorobenzyl)isothiourea hydrochloride | cid_199161
Type:
Small organic molecule
Emp. Form.:
C8H9ClN2S
Mol. Mass.:
200.688
SMILES:
NC(=N)SCc1ccccc1Cl
: