Target
Guanine nucleotide-binding protein subunit alpha-15
Ligand
BDBM96810
Substrate
EC50
>29894±n/a nM
Citation
 PubChem, PC Counterscreen for agonists of the human trace amine associated receptor 1 (TAAR1): Fluorescence-based cell-based high throughput dose response assay to identify nonselective Ga16 agonists PubChem Bioassay (2013)[AID] 
Target
Name:
Guanine nucleotide-binding protein subunit alpha-15
Synonyms:
G-protein subunit alpha-16 GNA15 GNA16 | guanine nucleotide-binding protein subunit alpha-15
Type:
Protein
Mol. Mass.:
43577.62
Organism:
Homo sapiens (Human)
Description:
P30679
Residue:
374
  
Inhibitor
Name:
BDBM96810
Synonyms:
(2-anilino-6-methyl-pyrimidin-4-yl)-dimethyl-amine MLS001360438 N4,N4,6-trimethyl-N2-phenylpyrimidine-2,4-diamine cid_718645
Type:
Small organic molecule
Emp. Form.:
C13H16N4
Mol. Mass.:
228.2929
SMILES:
CN(C)c1cc(C)nc(Nc2ccccc2)n1
: