Target
Guanine nucleotide-binding protein subunit alpha-15
Ligand
BDBM96821
Substrate
EC50
>29931±n/a nM
Citation
 PubChem, PC Counterscreen for agonists of the human trace amine associated receptor 1 (TAAR1): Fluorescence-based cell-based high throughput dose response assay to identify nonselective Ga16 agonists PubChem Bioassay (2013)[AID] 
Target
Name:
Guanine nucleotide-binding protein subunit alpha-15
Synonyms:
G protein alpha 16 G-protein subunit alpha-16 (G alpha-16) GNA15_HUMAN Guanine nucleotide-binding protein subunit alpha-15 [Y147C]
Type:
Protein
Mol. Mass.:
43577.62
Organism:
Homo sapiens (Human)
Description:
P30679
Residue:
374
  
Inhibitor
Name:
BDBM96821
Synonyms:
1,3-dimethyl-2,3-dihydro-1H-benzo[f][1,3]benzoxazine SMR001556935 | cid_241049
Type:
Small organic molecule
Emp. Form.:
C14H15NO
Mol. Mass.:
213.275
SMILES:
CC1NC(C)c2c(O1)ccc1ccccc21
: