Target
Guanine nucleotide-binding protein subunit alpha-15
Ligand
BDBM96832
Substrate
EC50
>29904±n/a nM
Citation
 PubChem, PC Counterscreen for agonists of the human trace amine associated receptor 1 (TAAR1): Fluorescence-based cell-based high throughput dose response assay to identify nonselective Ga16 agonists PubChem Bioassay (2013)[AID] 
Target
Name:
Guanine nucleotide-binding protein subunit alpha-15
Synonyms:
G protein alpha 16 G-protein subunit alpha-16 (G alpha-16) GNA15_HUMAN Guanine nucleotide-binding protein subunit alpha-15 [Y147C]
Type:
Protein
Mol. Mass.:
43577.62
Organism:
Homo sapiens (Human)
Description:
P30679
Residue:
374
  
Inhibitor
Name:
BDBM96832
Synonyms:
MLS001029373 N-[2-(2-chlorophenyl)ethyl]-3-(8-oxidanylidene-6-sulfanylidene-5H-[1,3]dioxolo[4,5-g]quinazolin-7-yl)propanamide SMR000634351 | cid_3574265
Type:
Small organic molecule
Emp. Form.:
C20H18ClN3O4S
Mol. Mass.:
431.893
SMILES:
Clc1ccccc1CCNC(=O)CCn1c(=S)[nH]c2cc3OCOc3cc2c1=O
: