Target
Trace amine-associated receptor 1
Ligand
BDBM96559
Substrate
EC50
154.41±n/a nM
Citation
 PubChem, PC Fluorescence-based cell-based high throughput dose response assay to identify agonists of the human trace amine associated receptor 1 (TAAR1) PubChem Bioassay (2013)[AID] 
Target
Name:
Trace amine-associated receptor 1
Synonyms:
TA1 TAAR1_HUMAN TRAR1 | trace amine-associated receptor 1
Type:
PROTEIN
Mol. Mass.:
39107.47
Organism:
Homo sapiens (Human)
Description:
ChEMBL_792734
Residue:
339
  
Inhibitor
Name:
BDBM96559
Synonyms:
2-(1,2,3,4-tetrahydronaphthalen-1-yl)-4,5-dihydro-1H-imidazole;hydrochloride MLS000069739 TETRAHYDROZOLINE Tyzine | cid_10648
Type:
Small organic molecule
Emp. Form.:
C13H16N2
Mol. Mass.:
200.2795
SMILES:
C1CN=C(N1)C1CCCc2ccccc12
: