Target
Guanine nucleotide-binding protein subunit alpha-15
Ligand
BDBM96877
Substrate
IC50
>29866±n/a nM
Citation
 PubChem, PC Counterscreen for agonists of the human trace amine associated receptor 1 (TAAR1): Fluorescence-based cell-based high throughput dose response assay to identify nonselective Ga16 antagonists PubChem Bioassay (2013)[AID] 
Target
Name:
Guanine nucleotide-binding protein subunit alpha-15
Synonyms:
G-protein subunit alpha-16 GNA15 GNA16 | guanine nucleotide-binding protein subunit alpha-15
Type:
Protein
Mol. Mass.:
43577.62
Organism:
Homo sapiens (Human)
Description:
P30679
Residue:
374
  
Inhibitor
Name:
BDBM96877
Synonyms:
(2S)-N-[2-(2-chlorophenyl)ethyl]-1-[(2S)-2-(o-toluoylamino)-2-phenyl-acetyl]pyrrolidine-2-carboxamide (2S)-N-[2-(2-chlorophenyl)ethyl]-1-[(2S)-2-[(2-methylphenyl)carbonylamino]-2-phenyl-ethanoyl]pyrrolidine-2-carboxamide MLS003777904 cid_53361906
Type:
Small organic molecule
Emp. Form.:
C29H30ClN3O3
Mol. Mass.:
504.02
SMILES:
Cc1ccccc1C(=O)N[C@H](C(=O)N1CCC[C@H]1C(=O)NCCc1ccccc1Cl)c1ccccc1
: