Target
Guanine nucleotide-binding protein subunit alpha-15
Ligand
BDBM96917
Substrate
EC50
>29905±n/a nM
Citation
 PubChem, PC Counterscreen for antagonists of the human trace amine associated receptor 1 (TAAR1): Fluorescence-based cell-based high throughput dose reponse assay to identify nonselective Ga16 agonists PubChem Bioassay (2013)[AID] 
Target
Name:
Guanine nucleotide-binding protein subunit alpha-15
Synonyms:
G-protein subunit alpha-16 GNA15 GNA16 | guanine nucleotide-binding protein subunit alpha-15
Type:
Protein
Mol. Mass.:
43577.62
Organism:
Homo sapiens (Human)
Description:
P30679
Residue:
374
  
Inhibitor
Name:
BDBM96917
Synonyms:
4-[(2-bromanylphenoxy)methyl]-N-pyridin-3-yl-benzamide 4-[(2-bromophenoxy)methyl]-N-(3-pyridyl)benzamide MLS001198301 cid_1239651
Type:
Small organic molecule
Emp. Form.:
C19H15BrN2O2
Mol. Mass.:
383.239
SMILES:
Brc1ccccc1OCc1ccc(cc1)C(=O)Nc1cccnc1
: