Target
Probable global transcription activator SNF2L2
Ligand
BDBM70509
Substrate
EC50
91189±n/a nM
Citation
 PubChem, PC Luminescence-based cell-based high throughput dose response assay to identify activators of the function of SWI/SNF related, matrix associated, actin dependent regulator of chromatin, subfamily a, member 2 (SMARCA2, BRM) PubChem Bioassay (2013)[AID] 
Target
Name:
Probable global transcription activator SNF2L2
Synonyms:
ATP-dependent helicase SMARCA2 BRG1-associated factor 190B Protein brahma homolog SMCA2_HUMAN SNF2A SWI/SNF-related matrix-associated actin-dependent regulator of chromatin subfamily A member 2 | hBRM
Type:
Enzyme Catalytic Domain
Mol. Mass.:
181290.91
Organism:
Homo sapiens (Human)
Description:
P51531
Residue:
1590
  
Inhibitor
Name:
BDBM70509
Synonyms:
2-(5-Bromo-furan-2-yl)-1-(5-bromo-furan-2-ylmethyl)-1H-benzoimidazole 2-(5-bromo-2-furanyl)-1-[(5-bromo-2-furanyl)methyl]benzimidazole 2-(5-bromofuran-2-yl)-1-[(5-bromofuran-2-yl)methyl]benzimidazole SMR000149736 | cid_1522262
Type:
Small organic molecule
Emp. Form.:
C16H10Br2N2O2
Mol. Mass.:
422.071
SMILES:
Brc1ccc(Cn2c(nc3ccccc23)-c2ccc(Br)o2)o1
: