Target
Probable global transcription activator SNF2L2
Ligand
BDBM96951
Substrate
EC50
91207±n/a nM
Citation
 PubChem, PC Luminescence-based cell-based high throughput dose response assay to identify activators of the function of SWI/SNF related, matrix associated, actin dependent regulator of chromatin, subfamily a, member 2 (SMARCA2, BRM) PubChem Bioassay (2013)[AID] 
Target
Name:
Probable global transcription activator SNF2L2
Synonyms:
ATP-dependent helicase SMARCA2 BRG1-associated factor 190B Protein brahma homolog SMCA2_HUMAN SNF2A SWI/SNF-related matrix-associated actin-dependent regulator of chromatin subfamily A member 2 | hBRM
Type:
Enzyme Catalytic Domain
Mol. Mass.:
181290.91
Organism:
Homo sapiens (Human)
Description:
P51531
Residue:
1590
  
Inhibitor
Name:
BDBM96951
Synonyms:
3-ethyl-2-ethylimino-4-keto-1,3-thiazine-6-carboxylic acid methyl ester MLS000520424 cid_1518670 methyl 3-ethyl-2-ethylimino-4-oxo-1,3-thiazine-6-carboxylate
Type:
Small organic molecule
Emp. Form.:
C10H14N2O3S
Mol. Mass.:
242.295
SMILES:
CC\N=c1/sc(cc(=O)n1CC)C(=O)OC
: