Target
Probable global transcription activator SNF2L2
Ligand
BDBM61923
Substrate
EC50
91189±n/a nM
Citation
 PubChem, PC Luminescence-based cell-based high throughput dose response assay to identify activators of the function of SWI/SNF related, matrix associated, actin dependent regulator of chromatin, subfamily a, member 2 (SMARCA2, BRM) PubChem Bioassay (2013)[AID] 
Target
Name:
Probable global transcription activator SNF2L2
Synonyms:
ATP-dependent helicase SMARCA2 BRG1-associated factor 190B Protein brahma homolog SMCA2_HUMAN SNF2A SWI/SNF-related matrix-associated actin-dependent regulator of chromatin subfamily A member 2 | hBRM
Type:
Enzyme Catalytic Domain
Mol. Mass.:
181290.91
Organism:
Homo sapiens (Human)
Description:
P51531
Residue:
1590
  
Inhibitor
Name:
BDBM61923
Synonyms:
KSC-6-110 N-(3-keto-2-phenyl-1,2-benzothiazol-5-yl)acetamide N-(3-oxo-2-phenyl-1,2-benzothiazol-5-yl)acetamide | cid_44593869
Type:
Small organic molecule
Emp. Form.:
C15H12N2O2S
Mol. Mass.:
284.333
SMILES:
CC(=O)Nc1ccc2sn(-c3ccccc3)c(=O)c2c1
: