Target
Galanin receptor type 3
Ligand
BDBM37434
Substrate
IC50
86.87±n/a nM
Citation
 PubChem, PC Fluorescence-based cell-based primary high throughput dose response assay to identify antagonists of the Galanin Receptor 3 (GalR3). PubChem Bioassay (2013)[AID] 
Target
Name:
Galanin receptor type 3
Synonyms:
GALNR3 GALR3_HUMAN Galanin receptor 3 | Galanin receptor type 3
Type:
Enzyme Catalytic Domain
Mol. Mass.:
39599.97
Organism:
Homo sapiens (Human)
Description:
Galanin R3 GALR3 HUMAN::O60755
Residue:
368
  
Inhibitor
Name:
BDBM37434
Synonyms:
2-[(1-bicyclo[2.2.1]hept-2-yl-1H-tetrazol-5-yl)thio]-N-4-quinolinylacetamide 2-[[1-(2-norbornyl)tetrazol-5-yl]thio]-N-(4-quinolyl)acetamide 2-[[1-(3-bicyclo[2.2.1]heptanyl)-5-tetrazolyl]thio]-N-(4-quinolinyl)acetamide SMR000079553 | cid_2967368
Type:
Small organic molecule
Emp. Form.:
C19H20N6OS
Mol. Mass.:
380.467
SMILES:
[H]C12CCC([H])(C1)C(C2)n1nnnc1SCC(=O)Nc1ccnc2ccccc12
: