Target
Galanin receptor type 3
Ligand
BDBM89268
Substrate
IC50
512.94±n/a nM
Citation
 PubChem, PC Fluorescence-based cell-based primary high throughput dose response assay to identify antagonists of the Galanin Receptor 3 (GalR3). PubChem Bioassay (2013)[AID] 
Target
Name:
Galanin receptor type 3
Synonyms:
GALNR3 GALR3_HUMAN Galanin receptor 3 | Galanin receptor type 3
Type:
Enzyme Catalytic Domain
Mol. Mass.:
39599.97
Organism:
Homo sapiens (Human)
Description:
Galanin R3 GALR3 HUMAN::O60755
Residue:
368
  
Inhibitor
Name:
BDBM89268
Synonyms:
4-(2,4-dichlorophenyl)-2-(2-phenylethanoylamino)thiophene-3-carboxamide 4-(2,4-dichlorophenyl)-2-[(2-phenylacetyl)amino]thiophene-3-carboxamide MLS000583246 cid_1245647
Type:
Small organic molecule
Emp. Form.:
C19H14Cl2N2O2S
Mol. Mass.:
405.298
SMILES:
NC(=O)c1c(NC(=O)Cc2ccccc2)scc1-c1ccc(Cl)cc1Cl
: