Target
Galanin receptor type 3
Ligand
BDBM97194
Substrate
IC50
>368.85±n/a nM
Citation
 PubChem, PC Fluorescence-based cell-based primary high throughput dose response assay to identify antagonists of the Galanin Receptor 3 (GalR3). PubChem Bioassay (2013)[AID] 
Target
Name:
Galanin receptor type 3
Synonyms:
GALNR3 GALR3_HUMAN Galanin receptor 3 | Galanin receptor type 3
Type:
Enzyme Catalytic Domain
Mol. Mass.:
39599.97
Organism:
Homo sapiens (Human)
Description:
Galanin R3 GALR3 HUMAN::O60755
Residue:
368
  
Inhibitor
Name:
BDBM97194
Synonyms:
2-[4-[(2,3-dichlorophenyl)methyl]-1-piperazinyl]-5-(phenylmethyl)pyrimidine 5-benzyl-2-[4-(2,3-dichlorobenzyl)piperazino]pyrimidine MLS003872358 cid_53385437
Type:
Small organic molecule
Emp. Form.:
C22H22Cl2N4
Mol. Mass.:
413.343
SMILES:
Clc1cccc(CN2CCN(CC2)c2ncc(Cc3ccccc3)cn2)c1Cl
: