Target
Nuclear receptor subfamily 0 group B member 1
Ligand
BDBM49371
Substrate
IC50
>833.79±n/a nM
Citation
 PubChem, PC Luminescence-based cell-based high throughput dose response assay for inhibitors of the orphan nuclear receptor subfamily 0, group B, member 1 (DAX1; NR0B1): repression of SF-1 (NR5A1) activated StAR promoter by full-length DAX-1 PubChem Bioassay (2013)[AID] 
Target
Name:
Nuclear receptor subfamily 0 group B member 1
Synonyms:
AHC NR0B1 | NR0B1_HUMAN
Type:
Enzyme Catalytic Domain
Mol. Mass.:
51729.22
Organism:
Homo sapiens (Human)
Description:
gi_5016090
Residue:
470
  
Inhibitor
Name:
BDBM49371
Synonyms:
1,4,5,6-Tetrahydro-cyclopentapyrazole-3-carboxylic acid (2-bromo-3-phenyl-allylidene)-hydrazide N-[(E)-[(E)-2-bromo-3-phenyl-prop-2-enylidene]amino]-1,4,5,6-tetrahydrocyclopenta[c]pyrazole-3-carboxamide N-[[(Z)-2-bromanyl-3-phenyl-prop-2-enylidene]amino]-1,4,5,6-tetrahydrocyclopenta[c]pyrazole-3-carboxamide N-[[(Z)-2-bromo-3-phenylprop-2-enylidene]amino]-1,4,5,6-tetrahydrocyclopenta[c]pyrazole-3-carboxamide cid_1097667
Type:
Small organic molecule
Emp. Form.:
C16H15BrN4O
Mol. Mass.:
359.22
SMILES:
BrC(C=NNC(=O)c1[nH]nc2CCCc12)=Cc1ccccc1
: