Target
Nuclear receptor subfamily 0 group B member 1
Ligand
BDBM50049395
Substrate
IC50
>833.72±n/a nM
Citation
 PubChem, PC Luminescence-based cell-based high throughput dose response assay for inhibitors of the orphan nuclear receptor subfamily 0, group B, member 1 (DAX1; NR0B1): repression of SF-1 (NR5A1) activated StAR promoter by full-length DAX-1 PubChem Bioassay (2013)[AID] 
Target
Name:
Nuclear receptor subfamily 0 group B member 1
Synonyms:
AHC NR0B1 | NR0B1_HUMAN
Type:
Enzyme Catalytic Domain
Mol. Mass.:
51729.22
Organism:
Homo sapiens (Human)
Description:
gi_5016090
Residue:
470
  
Inhibitor
Name:
BDBM50049395
Synonyms:
5,7,4'-Trihydroxy-6-methoxyflavone 5,7-dihydroxy-2-(4-hydroxyphenyl)-6-methoxy-4H-chromen-4-one 6-methoxyapigenin Hispidulin TCMDC-123942 dinatin
Type:
Small organic molecule
Emp. Form.:
C16H12O6
Mol. Mass.:
300.2629
SMILES:
COc1c(O)cc2oc(cc(=O)c2c1O)-c1ccc(O)cc1
: