Target
Nuclear receptor subfamily 0 group B member 1
Ligand
BDBM97328
Substrate
IC50
>30.87±n/a nM
Citation
 PubChem, PC Luminescence-based cell-based high throughput dose response assay for inhibitors of the orphan nuclear receptor subfamily 0, group B, member 1 (DAX1; NR0B1): repression of SF-1 (NR5A1) activated StAR promoter by full-length DAX-1 PubChem Bioassay (2013)[AID] 
Target
Name:
Nuclear receptor subfamily 0 group B member 1
Synonyms:
AHC NR0B1 | NR0B1_HUMAN
Type:
Enzyme Catalytic Domain
Mol. Mass.:
51729.22
Organism:
Homo sapiens (Human)
Description:
gi_5016090
Residue:
470
  
Inhibitor
Name:
BDBM97328
Synonyms:
(S)-[5,6,7,9-TETRAHYDRO-1,2,3-TRIMETHOXY-10-(METHYLTHIO)-9-OXOBENZO[A]HEPTALEN-7-YL]CARBAMIC ACID, ETHYL ESTER N-[1,2,3-trimethoxy-10-(methylthio)-9-oxo-6,7-dihydro-5H-benzo[a]heptalen-7-yl]carbamic acid ethyl ester SMR001566842 ethyl N-(1,2,3-trimethoxy-10-methylsulfanyl-9-oxidanylidene-6,7-dihydro-5H-benzo[a]heptalen-7-yl)carbamate | ethyl N-(1,2,3-trimethoxy-10-methylsulfanyl-9-oxo-6,7-dihydro-5H-benzo[a]heptalen-7-yl)carbamate
Type:
Small organic molecule
Emp. Form.:
C23H27NO6S
Mol. Mass.:
445.529
SMILES:
CCOC(=O)NC1CCc2cc(OC)c(OC)c(OC)c2-c2ccc(SC)c(=O)cc12
: