Target
Nuclear receptor subfamily 0 group B member 1
Ligand
BDBM97355
Substrate
IC50
>92.6±n/a nM
Citation
 PubChem, PC Luminescence-based cell-based high throughput dose response assay for inhibitors of the orphan nuclear receptor subfamily 0, group B, member 1 (DAX1; NR0B1): repression of SF-1 (NR5A1) activated StAR promoter by full-length DAX-1 PubChem Bioassay (2013)[AID] 
Target
Name:
Nuclear receptor subfamily 0 group B member 1
Synonyms:
AHC NR0B1 | NR0B1_HUMAN
Type:
Enzyme Catalytic Domain
Mol. Mass.:
51729.22
Organism:
Homo sapiens (Human)
Description:
gi_5016090
Residue:
470
  
Inhibitor
Name:
BDBM97355
Synonyms:
5-(1,3-benzodioxol-5-yl)-N-phenyl-1,3,4-oxadiazol-2-amine SMR001874598 cid_100596
Type:
Small organic molecule
Emp. Form.:
C15H11N3O3
Mol. Mass.:
281.2661
SMILES:
C1Oc2ccc(cc2O1)-c1nnc(Nc2ccccc2)o1
: