Target
Acetyl-CoA carboxylase
Ligand
BDBM97624
Substrate
Meas. Tech.
Luminometric Assay
pH
7.5±n/a
Temperature
310.15±n/a K
IC50
1500±n/a nM
Comments
extracted
Citation
 Zoller, GSchmoll, DMueller, MHaschke, GFocken, I Heterocyclic compounds, processes for their preparation, medicaments comprising these compounds, and the use thereof US Patent  US8470841 Publication Date 6/25/2013 
Target
Name:
Acetyl-CoA carboxylase
Synonyms:
Acetyl-CoA carboxylase 2 (ACC2) | Acetyl-Coenzyme A carboxylase 2
Type:
Protein
Mol. Mass.:
276278.59
Organism:
Rattus norvegicus (Rat)
Description:
Residue:
2455
  
Inhibitor
Name:
BDBM97624
Synonyms:
US8470841, 59
Type:
Small organic molecule
Emp. Form.:
C20H25NO4
Mol. Mass.:
343.4168
SMILES:
CC(C)Oc1ccc(Oc2ccc(OC[C@H](C)NC(C)=O)cc2)cc1
: