Target
Activated CDC42 kinase 1
Ligand
BDBM98197
Substrate
Meas. Tech.
AlphaScreen Assay
IC50
3.3e+2±n/a nM
Citation
 Crew, APJin, MKadalbajoo, MKleinberg, AMulvihill, MJWang, J Substituted imidazopyr- and imidazotri-azines US Patent  US8481733 Publication Date 7/9/2013 
Target
Name:
Activated CDC42 kinase 1
Synonyms:
ACK1 Activated CDC42 kinase 1 (ACK-1) Tyrosine kinase non-receptor protein 2
Type:
Protein
Mol. Mass.:
114577.86
Organism:
Homo sapiens (Human)
Description:
Q07912
Residue:
1038
  
Inhibitor
Name:
BDBM98197
Synonyms:
US8481733, 8
Type:
Small organic molecule
Emp. Form.:
C22H22N4O
Mol. Mass.:
358.4363
SMILES:
CC(C)(C)c1nc(-c2ccc(Oc3ccccc3)cc2)c2c(N)nccn12
: