Target
Kallikrein-7
Ligand
BDBM100171
Substrate
EC50
7442±n/a nM
Citation
 PubChem, PC Fluorescence Intensity-based biochemical primary high throughput dose response assay to identify activators of kallikrein-7 (K7) zymogen PubChem Bioassay (2013)[AID] 
Target
Name:
Kallikrein-7
Synonyms:
KLK7 Kallikrein 7 PRSS6 Serine protease 6 hK7 kallikrein-7 isoform 1 preproprotein
Type:
PROTEIN
Mol. Mass.:
27535.05
Organism:
Homo sapiens (Human)
Description:
ChEMBL_1469257
Residue:
253
  
Inhibitor
Name:
BDBM100171
Synonyms:
MLS002920943 N-[(2S,3R,12bS)-3-[(1S)-1-hydroxyethyl]-4-keto-2,3,6,7,12,12b-hexahydro-1H-pyrido[2,1-a]-carbolin-2-yl]-N-methyl-benzenesulfonamide N-[(2S,3R,12bS)-3-[(1S)-1-oxidanylethyl]-4-oxidanylidene-2,3,6,7,12,12b-hexahydro-1H-indolo[2,3-a]quinolizin-2-yl]-N-methyl-benzenesulfonamide cid_46902353
Type:
Small organic molecule
Emp. Form.:
C24H27N3O4S
Mol. Mass.:
453.554
SMILES:
C[C@H](O)[C@H]1[C@H](C[C@@H]2N(CCc3c2[nH]c2ccccc32)C1=O)N(C)S(=O)(=O)c1ccccc1
: