Target
Monoacylglycerol lipase ABHD2
Ligand
BDBM280615
Substrate
Meas. Tech.
In Vitro Competitive Activity-Based Protein Profiling
IC50
<100±n/a nM
Citation
 Cisar, JSGrice, CAJones, TKWeber, ODBuzard, DJShaghafi, MB Spirocycle compounds and methods of making and using same US Patent  US10030020 Publication Date 7/24/2018 
Target
Name:
Monoacylglycerol lipase ABHD2
Synonyms:
2-arachidonoylglycerol hydrolase Abhd2 Labh-2 Lung alpha/beta hydrolase 2 | MmLABH2
Type:
Enzyme Catalytic Domain
Mol. Mass.:
48378.90
Organism:
Mus musculus (Mouse)
Description:
Residue:
425
  
Inhibitor
Name:
BDBM280615
Synonyms:
US10030020, Example 160 | US10781211, Example 160
Type:
Small organic molecule
Emp. Form.:
C24H29F6N3O3
Mol. Mass.:
521.4958
SMILES:
CC(=O)N1CCc2cccc(CN3CCC4(C3)CCN(CC4)C(=O)OC(C(F)(F)F)C(F)(F)F)c2C1
: