Target
Kappa-type opioid receptor
Ligand
BDBM4207
Substrate
Meas. Tech.
Binding Assay
Ki
0.15±0 nM
Citation
 Kyle, DJGoehring, RRFundytus, ME Buprenophine analogs US Patent  US8530494 Publication Date 9/10/2013 
Target
Name:
Kappa-type opioid receptor
Synonyms:
K-OR-1 Kappa-opioid receptor (KOR) Kappa-type opioid receptor (KOR) OPIATE Kappa OPRK1 kappa opioid receptor (KOR)
Type:
G Protein-Coupled Receptor (GPCR)
Mol. Mass.:
42648.76
Organism:
Homo sapiens (Human)
Description:
P41145
Residue:
380
  
Inhibitor
Name:
BDBM4207
Synonyms:
US8530494, 103
Type:
Emp. Form.:
C31H37NO4
Mol. Mass.:
487.6298
SMILES:
COc1ccc2C[C@H]3N(CC4CC4)CC[C@@]45[C@@H](Oc1c24)[C@]1(CC[C@@]35C[C@@H]1COc1ccccc1)OC
: