Target
Isoform 3 of Acetyl-CoA carboxylase 2 (ACC2.v2)
Ligand
BDBM101955
Substrate
Meas. Tech.
Enzyme Assay
IC50
6e+1±n/a nM
Citation
 Fleck, MNosse, BHeine, NRoth, GJ Azetidine derivatives US Patent  US8530460 Publication Date 9/10/2013 
Target
Name:
Isoform 3 of Acetyl-CoA carboxylase 2 (ACC2.v2)
Synonyms:
ACACB ACC2 Acetyl-CoA carboxylase 2 (ACC2) | Acetyl-CoA carboxylase 2 (ACC2.v2)
Type:
Protein
Mol. Mass.:
255085.30
Organism:
Homo sapiens (Human)
Description:
AJ575592.3
Residue:
2256
  
Inhibitor
Name:
BDBM101955
Synonyms:
US8530460, 1.35
Type:
Small organic molecule
Emp. Form.:
C24H30N2O3
Mol. Mass.:
394.5066
SMILES:
CCCOc1ccc(cc1)N1CC(C1)Oc1ccc(cc1)[C@H](C)NC(=O)C1CC1
: