Target
Kinesin-like protein KIF11
Ligand
BDBM34536
Substrate
Meas. Tech.
In Vitro Assay
IC50
0.9±n/a nM
Citation
 Abrams, TBarsanti, PDing, YDuhl, DHan, WHu, CPan, Y Triazole compounds as KSP inhibitors US Patent  US8546434 Publication Date 10/1/2013 
Target
Name:
Kinesin-like protein KIF11
Synonyms:
EG5 KIF11_HUMAN Kinesin Spindle Protein Eg5 TRIP5 | kinesin spindle protein
Type:
PROTEIN
Mol. Mass.:
119138.97
Organism:
Homo sapiens (Human)
Description:
ChEMBL_1457426
Residue:
1056
  
Inhibitor
Name:
BDBM34536
Synonyms:
US8546434, 10
Type:
Emp. Form.:
C30H35F4N5O3
Mol. Mass.:
589.6242
SMILES:
COC(C)(C)[C@@H](N(C[C@@H]1CNC[C@@H]1F)C(=O)[C@@H]1CCCO1)c1nc(nn1Cc1cccc(F)c1)-c1cc(F)ccc1F
: