Target
Androgen receptor
Ligand
BDBM18525
Substrate
Meas. Tech.
HDAC Activity Assay
Ki
2.46e+3±n/a nM
IC50
3.69e+3±n/a nM
Citation
 Gryder, BEAkbashev, MJRood, MKRaftery, EDMeyers, WMDillard, PKhan, SOyelere, AK Selectively targeting prostate cancer with antiandrogen equipped histone deacetylase inhibitors. ACS Chem Biol 8:2550-60 (2013)  
Target
Name:
Androgen receptor
Synonyms:
ANDR_HUMAN Androgen Receptor Androgen receptor/Baculoviral IAP repeat-containing protein 2 Dihydrotestosterone receptor Nuclear receptor subfamily 3 group C member 4
Type:
Receptor
Mol. Mass.:
99185.27
Organism:
Homo sapiens (Human)
Description:
CHO cells were stably transfected with human AR gene.
Residue:
920
  
Inhibitor
Name:
BDBM18525
Synonyms:
Bicalutamide N-[4-cyano-3-(trifluoromethyl)phenyl]-3-[(4-fluorobenzene)sulfonyl]-2-hydroxy-2-methylpropanamide US20230382870, Bicalutumide US9682960, CAS
Type:
Small organic molecule
Emp. Form.:
C18H14F4N2O4S
Mol. Mass.:
430.373
SMILES:
CC(O)(CS(=O)(=O)c1ccc(F)cc1)C(=O)Nc1ccc(C#N)c(c1)C(F)(F)F
: